1. Collect2 Exe Error Dev C 2b 2b 2
  2. Collect2 Error
  3. Collect2 Exe Error Dev C 2b 2b 1
  4. Collect2 Error Ld Returned 1 Exit Status
  5. Collect2 Exe Error Dev C 2b 2b 3

Collect2: ld returned 1 exit status: salathia: Linux - Newbie: 1: 12:04 PM SOLVED collect2: ld returned 1 exit status: linuxpremi: Linux - Newbie: 3: 11:54 PM: A different collect2: ld returned 1 exit status: oldasafossil: Linux - General: 0: 10:57 AM: collect2: ld returned 1 exit status: kvijaik: Linux.

Collect2: error: ld returned 1 exit status

  1. The source is Collect2.exe:-1: error: error: ld returned 1 exit status SOLVED Important collect2.exe: error: ld returned 1 exit status Makefile.Release:77: recipe for target Undefined reference to main c.
  2. Collect2.exe:-1: error: error: ld returned 1 exit status SOLVED This topic has been deleted. Only users with topic management privileges can see it. Whiterabbott last edited. I have installed Qt 5.1.1 on my windows 8 machine. I am compiling with mingw and want in link to gsl.

What does 'collect2: error: ld returned 1 exit status' mean?, Your problem is the typo in the function CreateDectionary().You should change it to CreateDictionary(). collect2: error: ld returned 1 exit status Try including conio.h if you are using TurboC. If you are using GCC,this won't work even if you include it.Also,use int main() instead of void main() and add a return 0; at the end.Also the program would just print Hi. and exit whatsoever be the input – Spikatrix Dec 3 '14 at 13:07

C compile : collect2: error: ld returned 1 exit status, ERROR collect2: ld returned 1 exit status. I am getting this message when building a application but do not have any idea what is causing the Here, we are going to learn why an Error: Id returned 1 exit status (undefined reference to 'main') occurs and how to fixed in C programming language? Submitted by IncludeHelp, on September 11, 2018 As we know that, Each program must have a main() function, compiler starts execution from the main() function - main() is an entry point to the

ERROR collect2: ld returned 1 exit status, /tmp/ccYeJqKe.o: In function `main': test.c:(.text+0x12): undefined reference to `​npth_init' collect2: error: ld returned 1 exit status. The source is Collect2.exe:-1: error: error: ld returned 1 exit status [SOLVED] Important collect2.exe: error: ld returned 1 exit status Makefile.Release:77: recipe for target

Undefined reference to main c

Undefined reference to main() means that your program lacks a main() function, which is mandatory for all C++ programs. Add this somewhere: int main() { return 0; }

Here, we will learn why an error: undefined reference to 'main' occurs and how to fix it in C programming language? Submitted by IncludeHelp , on September 04, 2018 The error: undefined reference to 'main' in C program is a very stupid mistake by the programmer, it occurs when the main() function does not exist in the program.

Collect2 Exe Error Dev C 2b 2b 2

crt0_c.c:(.text.startup+0x39): undefined reference to `[email protected] In this situation, you need to compile both the the source files on the same command line, for example, using GCC: $ g++ f1.cpp f2.cpp -o myprog

Collect2.exe error ld returned 1 exit status dev c++

C compile : collect2: error: ld returned 1 exit status, ++, usually it means that you have unresolved symbols. In your case is the typo that i mentioned before. I got this problem, and tried many ways to solve it. Here, we are going to learn why an Error: Id returned 1 exit status (undefined reference to 'main') occurs and how to fixed in C programming language? A humble request Our website is made possible by displaying online advertisements to our visitors.

What does 'collect2: error: ld returned 1 exit status' mean?, The ld returned 1 exit status error is the consequence of previous errors. In your example there is an earlier error - undefined reference to By the way, if you compile a C/C++ source file with no main function to execute, there will definitely be a bug message saying: '[Error] Id returned 1 exist status' But sometimes we just don't need main function in the file, in such a case, just ignore the bug message.

Error: Id returned 1 exit status (undefined reference to 'main'), Here, we are going to learn why an Error: Id returned 1 exit status (undefined reference to 'main') occurs and how to fixed in C programming language? undefined reference to `main' collect2: error: ld returned 1 exit status. Solution all problem 'Cannot open output Permission Deny ,How to remove dev c++ return 1 error, Fix return 1 error in Dev c++ , return 1 error in Dev c++, Re

Undefined reference to function in c

C error: undefined reference to function, but it IS defined, How are you doing the compiling and linking? You'll need to specify both files, something like: gcc testpoint.c point.c so that it knows to link C++ template methods and functions are not turned into machine code until the compiler runs into a call to the function with a specific type. But that means that the code that defines a template method, for example all of LinkedSortedList.cpp, actually does not produce any code at all when the compiler sees it.

C Language, gcc undefined_reference.c /tmp/ccoXhwF0.o: In function `main': undefined_reference.c:(.text+0x15): undefined reference to `foo' collect2: error: ld returned 1 exit An alternative situation arises where the source for foo() is in a separate source file foo.c (and there's a header foo.h to declare foo() that is included in both foo.c and undefined_reference.c). Then the fix is to link both the object file from foo.c and undefined_reference.c , or to compile both the source files:

Undefined reference/unresolved external symbol errors in C++/C , C++ mangled names of functions and variables(Why: wiki). So the declaration of C functions in C++ becomes a bit tricky. And as the name of f1.cpp:(.text+0xc): undefined reference to `foo()' and if you compile f2.cpp on its own, you get this even more frightening one: crt0_c.c:(.text.startup+0x39): undefined reference to `[email protected] In this situation, you need to compile both the the source files on the same command line, for example, using GCC: $ g++ f1.cpp f2.cpp -o myprog

Undefined reference to main makefile

makefile error: undefined reference to main, Whenever you are just compiling a file and not linking it, use the '-c' flag. For example :- db.o: db.cpp $(CC) -c $(CFLAGS) $(LDFLAGS) db.cpp Since the main function is most probably in the main.c and not in db.c, the linker fails when searching for the main function in db.c. This means that you need to tell the compiler that you just want output that is not yet linked, but translated into an object file and this is exactly what the -c flag does.

Solved: (.text+0x20): undefined reference to `main', x86_64-linux-gnu/crt1.o: In function `_start': (.text+0x20): undefined reference to `​main' collect2: error: ld returned 1 exit status. Makefile:79: ISSUE: database make file is working fine but main Makefile i am having some issue like. Error: main.o: In function main': main.cpp:(.text+0x92): undefined reference tomydatabase::mydatabase(int, int)' collect2: ld returned 1 exit status

Undefined reference to main / Undefined reference to , I put all these files in the same directory. Problem is, When I compile and build main.c - Getting Compilation failed - Undefined reference to ' libapbcs.c.text+0x42c): undefined reference to `coredump_close' libapbcs.c .text+0x43c): undefined reference to `coredump_free' I have checked that after running 'make clean' all object files dissappear (how surprising ) and after 'make' there are all the neccessary *.o files listed in the directory, but they somehow does not link.

Undefined reference to fork collect2 exe error ld returned 1 exit status

Thanks for contributing an answer to Stack Overflow! Please be sure to answer the question.Provide details and share your research! But avoid …. Asking for help, clarification, or responding to other answers.

Exe

C:QtToolsQtCreatorbinuntitledmain.cpp:-1: error: undefined reference to `gsl_sf_bessel_J0' collect2.exe:-1: error: error: ld returned 1 exit status The compile output is,

Collect2 Exe Error Dev C%2b%2b

Here, we are going to learn why an Error: Id returned 1 exit status (undefined reference to 'main') occurs and how to fixed in C programming language? Submitted by IncludeHelp, on September 11, 2018 As we know that, Each program must have a main() function, compiler starts execution from the main() function - main() is an entry point to the

Undefined reference to exec

In function main: undefined reference to exec, The page is not bogus. However, the code referenced per the link provided is actually Java, as the site refers to the ImageJ program, an 'Image In function main: undefined reference to exec [closed] Ask Question Asked 5 years, 10 months ago. Active 5 years, 10 months ago. Viewed 5k times -3. Closed. This

POSIX calls: Why does the gcc , exec('fileName', pair, envp); //'gcc -O0 -g3 -c' warning:implicit declaration of function 'exec' //'gcc' error: undefined reference to exec }. Re: [lammps-users] more undefined references to 'fftw_*' and ld returned 1 exit status when doing 'make mpi' in /src

undefined reference to `execvpe, I'm trying to use the execv function in std.process, but when the program links, it gives me an undefined reference to `execvpe' message. This is I saw Czarek had a similiar undefined reference. and it was because during compile he was unable to link to libcef.so. obviously my makefile is not linking correctly either. however, it does say that libcef.so is found.

Undefined reference to readfile

Undefined reference error in a C program, C is case sensitive; extern int readfile( FILE *in );. doesn't declare the same function as; int readFile( FILE *in ). Pick a casing and use it 'undefined reference' errors when compiling against library (2 answers) Closed 7 years ago . I'm having a problem trying to run the GNU Readline library sample code available in wikipedia .

Undefined reference in gcc/linux, However, I still get numerous undefined references, mostly for the error: undefined reference to 'XSControl_Reader::ReadFile(char const*)' Dismiss Join GitHub today. GitHub is home to over 50 million developers working together to host and review code, manage projects, and build software together.

`readFile' Main.c:(.text+0xbf7): Undefined Reference To , Question: I Don't Know What Is Wrong With My Code. When I Try To Run It It Gives Me The Error Main.c:(.text+0xaed): Undefined Reference To `readFile' > g++ -o'trial-2' ./src/trial-2.o Looks like you didn't link to the OCCT libraries. Look at the samples provided with the OCCT source distribution; there should be arguments to the linker like:

More Articles

COLLECT2.EXE process information

Description

Collect2 Error

: collect2.exe file from Unknown Company is part of unknown Product. collect2.exe located in e: Program Files Simply Fortran mingw-w64 libexec gcc x86_64-w64-mingw32 4 .7 .2 with file size 2008728.00 byte, file version Unknown Version, MD5 signature E334EE62F426E3742108B8E3BB439F22.

Check processes running in your PC using online security database. You could use any type of scanning to check your PC against Viruses, Trojans, Spywares and other malicious programs
Recommended: * To help you analyze the collect2.exe process on your computer, 'Asmwsoft PC optimizer' program have proven to be helpful.

Collect2 Exe Error Dev C 2b 2b 1

Comments:

Collect2 Error Ld Returned 1 Exit Status


No Comments yet! Please be the first one to add comments.

Collect2 Exe Error Dev C 2b 2b 3

RELATED:

Other Process:

cc1plus.execc1.exepthreadgc2-64.dllpthreadgc2-32.dllwindres.exe collect2.exe windmc.exesize.exereadelf.exeranlib.exeobjdump.exe [All processes]